{"text_format":"1","workbook":"xlsx","n_sheets":6,"sheets":["①現在の配下メンバー一覧","②入力用","③提出用","ラインナップシート","構成メンバー","方法"],"not_rendered":{"charts":0,"images":0,"macros":1,"external_links":0,"defined_names":2,"comments":0,"pivot_tables":0},"unopened":[],"bounds":{"document_bytes":16777216,"sheet_cells":100000,"rows_first":2000,"rows_last":500,"rows_between":2000,"halvings":0,"cell_chars":16384,"cell_head_chars":4096},"cells_cut":0,"cells_raw":0,"read":"whole","date_system":"1900"}

{"sheet":"①現在の配下メンバー一覧","index":0,"n_rows":42,"n_cols":30,"rows_kept":42,"cut":false,"hidden":false,"merged":[]}
[null,"年度","チームID","チーム名/団体名","競技区分","チーム区分","男女別","都道府県","メンバーID","氏名（姓）","氏名（名）","氏名カナ（姓）","氏名カナ（名）","氏名アルファベット（姓）","氏名アルファベット（名）","生年月日","性別","メンバー区分","所属状態","承認日","登録日","出身校","郵便番号","住所（都道府県）","住所（市区郡町村）","住所（丁目・番地）","住所（建物名）","電話番号","メールアドレス","身長(cm)"]
[]
[1]
[2]
[3]
[4]
[5]
[6]
[7]
[8]
[9]
[10]
[11]
[12]
[13]
[14]
[15]
[16]
[17]
[18]
[19]
[20]
[21]
[22]
[23]
[24]
[25]
[26]
[27]
[28]
[29]
[30]
[31]
[32]
[33]
[34]
[35]
[36]
[37]
[38]
{"$rows_left_out":3}
{"sheet":"②入力用","index":1,"n_rows":62,"n_cols":17,"rows_kept":62,"cut":false,"hidden":false,"merged":[[41,4,41,7],[14,1,14,3],[14,4,14,6],[15,1,15,3],[15,4,15,5],[16,1,18,2],[19,1,19,3],[19,4,19,6],[12,1,12,3],[12,4,12,6],[12,10,12,13],[13,1,13,3],[13,4,13,6],[13,10,13,13],[10,1,10,3],[10,4,10,6],[10,10,10,13],[11,1,11,3],[11,4,11,6],[11,10,11,13],[9,1,9,3],[9,4,9,6],[9,10,9,13],[0,1,2,13],[4,1,4,3],[5,1,5,3],[5,5,5,9],[6,1,6,3],[6,4,6,5],[7,1,7,3],[7,10,7,13],[8,1,8,3],[8,4,8,6],[8,10,8,13]]}
[null,"使用上の注意\nこのシステムは、毎回の大会参加申し込みの手間を省くために考え出したものです。\n但し、間違っていたときの保証はできませんので、\n必ずプリントアウトしたものを確認することを必ず行ってください。\n※印刷時に、よく間違う間違いとして、入力用画面を印刷する場合があります。\n必ず提出用にしてから印刷ください。"]
[]
[]
[]
[null,"年　　度"]
[null,"大会名",null,null,null,{"$f":"VLOOKUP(E6,$J$8:$N$14,2)","v":{"$error":"#N/A"}},null,null,null,null,null,"１から７の数字を入力"]
[null,"地　　区"]
[null,"男　ｏｒ　女",null,null,null,{"$f":"VLOOKUP(E8,$P$8:$Q$9,2)","v":{"$error":"#N/A"}},null,"１or２を選択",null,1,"県高校総体　〇〇地区予選",null,null,null,null,1,"㊚"]
[null,"チーム名",null,null,null,null,null,null,null,2,"〇〇地区総合体育",null,null,null,null,2,"㊛"]
[null,"所在地",null,null,null,null,null,null,null,3,"県　新　人"]
[null,"電話番号",null,null,null,null,null,null,null,4,"全日本バレーボール高等学校選手権大会岐阜県代表決定戦"]
[null,"監　　督",null,null,null,null,null,null,null,5,"県新人大会　〇〇地区予選"]
[null,"マネージャー",null,null,null,null,null,null,null,6,"県高校スプリングチャレンジカップ"]
[null,"コーチ",null,null,null,null,null,null,null,7]
[null,"キャプテン"]
[null,"健康状態"]
[null,"提\n出\n日",null,"年"]
[null,null,null,"月"]
[null,null,null,"日"]
[null,"学校長名",null,null,null,null,null,null,null,null,null,"選手データ",null,null,"日付"]
[]
[null,null,null,"選手氏名","年令","学年","身長",null,null,null,"番号","氏名","年令","学年","身長","誕生日"]
[null,1,null,{"$f":"IF(C23=\"\",\"\",VLOOKUP(C23,$K$23:$L$62,2))","v":""},{"$f":"IF(C23=\"\",\"\",VLOOKUP(C23,$K$23:$M$62,3))","v":""},{"$f":"IF(C23=\"\",\"\",VLOOKUP(C23,$K$23:$N$62,4))","v":""},{"$f":"IF(C23=\"\",\"\",VLOOKUP(C23,$K$23:$O$62,5))","v":""},null,null,null,1,{"$f":"VLOOKUP(K23,①現在の配下メンバー一覧!$A$3:$AD$42,10,FALSE)&VLOOKUP(K23,①現在の配下メンバー一覧!$A$3:$AD$42,11,FALSE)","v":""},{"$f":"DATEDIF(P23,TODAY(),\"Y\")","v":119},null,null,{"$f":"VLOOKUP(K23,①現在の配下メンバー一覧!$A$3:$AD$42,16,FALSE)","v":"00:00:00"}]
[null,2,null,{"$f":"IF(C24=\"\",\"\",VLOOKUP(C24,$K$23:$L$62,2))","v":""},{"$f":"IF(C24=\"\",\"\",VLOOKUP(C24,$K$23:$M$62,3))","v":""},{"$f":"IF(C24=\"\",\"\",VLOOKUP(C24,$K$23:$N$62,4))","v":""},{"$f":"IF(C24=\"\",\"\",VLOOKUP(C24,$K$23:$O$62,5))","v":""},null,null,null,2,{"$f":"VLOOKUP(K24,①現在の配下メンバー一覧!$A$3:$AD$42,10,FALSE)&VLOOKUP(K24,①現在の配下メンバー一覧!$A$3:$AD$42,11,FALSE)","v":""},{"$f":"DATEDIF(P24,TODAY(),\"Y\")","v":119},null,null,{"$f":"VLOOKUP(K24,①現在の配下メンバー一覧!$A$3:$AD$42,16,FALSE)","v":"00:00:00"}]
[null,3,null,"","","","",null,null,null,3,{"$f":"VLOOKUP(K25,①現在の配下メンバー一覧!$A$3:$AD$42,10,FALSE)&VLOOKUP(K25,①現在の配下メンバー一覧!$A$3:$AD$42,11,FALSE)","v":""},119,null,null,{"$f":"VLOOKUP(K25,①現在の配下メンバー一覧!$A$3:$AD$42,16,FALSE)","v":"00:00:00"}]
[null,4,null,"","","","",null,null,null,4,{"$f":"VLOOKUP(K26,①現在の配下メンバー一覧!$A$3:$AD$42,10,FALSE)&VLOOKUP(K26,①現在の配下メンバー一覧!$A$3:$AD$42,11,FALSE)","v":""},119,null,null,{"$f":"VLOOKUP(K26,①現在の配下メンバー一覧!$A$3:$AD$42,16,FALSE)","v":"00:00:00"}]
[null,5,null,"","","","",null,null,null,5,{"$f":"VLOOKUP(K27,①現在の配下メンバー一覧!$A$3:$AD$42,10,FALSE)&VLOOKUP(K27,①現在の配下メンバー一覧!$A$3:$AD$42,11,FALSE)","v":""},119,null,null,{"$f":"VLOOKUP(K27,①現在の配下メンバー一覧!$A$3:$AD$42,16,FALSE)","v":"00:00:00"}]
[null,6,null,"","","","",null,null,null,6,{"$f":"VLOOKUP(K28,①現在の配下メンバー一覧!$A$3:$AD$42,10,FALSE)&VLOOKUP(K28,①現在の配下メンバー一覧!$A$3:$AD$42,11,FALSE)","v":""},119,null,null,{"$f":"VLOOKUP(K28,①現在の配下メンバー一覧!$A$3:$AD$42,16,FALSE)","v":"00:00:00"}]
[null,7,null,"","","","",null,null,null,7,{"$f":"VLOOKUP(K29,①現在の配下メンバー一覧!$A$3:$AD$42,10,FALSE)&VLOOKUP(K29,①現在の配下メンバー一覧!$A$3:$AD$42,11,FALSE)","v":""},119,null,null,{"$f":"VLOOKUP(K29,①現在の配下メンバー一覧!$A$3:$AD$42,16,FALSE)","v":"00:00:00"}]
[null,8,null,"","","","",null,null,null,8,{"$f":"VLOOKUP(K30,①現在の配下メンバー一覧!$A$3:$AD$42,10,FALSE)&VLOOKUP(K30,①現在の配下メンバー一覧!$A$3:$AD$42,11,FALSE)","v":""},119,null,null,{"$f":"VLOOKUP(K30,①現在の配下メンバー一覧!$A$3:$AD$42,16,FALSE)","v":"00:00:00"}]
[null,9,null,"","","","",null,null,null,9,{"$f":"VLOOKUP(K31,①現在の配下メンバー一覧!$A$3:$AD$42,10,FALSE)&VLOOKUP(K31,①現在の配下メンバー一覧!$A$3:$AD$42,11,FALSE)","v":""},119,null,null,{"$f":"VLOOKUP(K31,①現在の配下メンバー一覧!$A$3:$AD$42,16,FALSE)","v":"00:00:00"}]
[null,10,null,"","","","",null,null,null,10,{"$f":"VLOOKUP(K32,①現在の配下メンバー一覧!$A$3:$AD$42,10,FALSE)&VLOOKUP(K32,①現在の配下メンバー一覧!$A$3:$AD$42,11,FALSE)","v":""},119,null,null,{"$f":"VLOOKUP(K32,①現在の配下メンバー一覧!$A$3:$AD$42,16,FALSE)","v":"00:00:00"}]
[null,11,null,"","","","",null,null,null,11,{"$f":"VLOOKUP(K33,①現在の配下メンバー一覧!$A$3:$AD$42,10,FALSE)&VLOOKUP(K33,①現在の配下メンバー一覧!$A$3:$AD$42,11,FALSE)","v":""},119,null,null,{"$f":"VLOOKUP(K33,①現在の配下メンバー一覧!$A$3:$AD$42,16,FALSE)","v":"00:00:00"}]
[null,12,null,"","","","",null,null,null,12,{"$f":"VLOOKUP(K34,①現在の配下メンバー一覧!$A$3:$AD$42,10,FALSE)&VLOOKUP(K34,①現在の配下メンバー一覧!$A$3:$AD$42,11,FALSE)","v":""},119,null,null,{"$f":"VLOOKUP(K34,①現在の配下メンバー一覧!$A$3:$AD$42,16,FALSE)","v":"00:00:00"}]
[null,13,null,"","","","",null,null,null,13,{"$f":"VLOOKUP(K35,①現在の配下メンバー一覧!$A$3:$AD$42,10,FALSE)&VLOOKUP(K35,①現在の配下メンバー一覧!$A$3:$AD$42,11,FALSE)","v":""},119,null,null,{"$f":"VLOOKUP(K35,①現在の配下メンバー一覧!$A$3:$AD$42,16,FALSE)","v":"00:00:00"}]
[null,14,null,"","","","",null,null,null,14,{"$f":"VLOOKUP(K36,①現在の配下メンバー一覧!$A$3:$AD$42,10,FALSE)&VLOOKUP(K36,①現在の配下メンバー一覧!$A$3:$AD$42,11,FALSE)","v":""},119,null,null,{"$f":"VLOOKUP(K36,①現在の配下メンバー一覧!$A$3:$AD$42,16,FALSE)","v":"00:00:00"}]
[null,15,null,"","","","",null,null,null,15,{"$f":"VLOOKUP(K37,①現在の配下メンバー一覧!$A$3:$AD$42,10,FALSE)&VLOOKUP(K37,①現在の配下メンバー一覧!$A$3:$AD$42,11,FALSE)","v":""},119,null,null,{"$f":"VLOOKUP(K37,①現在の配下メンバー一覧!$A$3:$AD$42,16,FALSE)","v":"00:00:00"}]
[null,16,null,"","","","",null,null,null,16,{"$f":"VLOOKUP(K38,①現在の配下メンバー一覧!$A$3:$AD$42,10,FALSE)&VLOOKUP(K38,①現在の配下メンバー一覧!$A$3:$AD$42,11,FALSE)","v":""},119,null,null,{"$f":"VLOOKUP(K38,①現在の配下メンバー一覧!$A$3:$AD$42,16,FALSE)","v":"00:00:00"}]
[null,17,null,"","","","",null,null,null,17,{"$f":"VLOOKUP(K39,①現在の配下メンバー一覧!$A$3:$AD$42,10,FALSE)&VLOOKUP(K39,①現在の配下メンバー一覧!$A$3:$AD$42,11,FALSE)","v":""},119,null,null,{"$f":"VLOOKUP(K39,①現在の配下メンバー一覧!$A$3:$AD$42,16,FALSE)","v":"00:00:00"}]
[null,18,null,"","","","",null,null,null,18,{"$f":"VLOOKUP(K40,①現在の配下メンバー一覧!$A$3:$AD$42,10,FALSE)&VLOOKUP(K40,①現在の配下メンバー一覧!$A$3:$AD$42,11,FALSE)","v":""},119,null,null,{"$f":"VLOOKUP(K40,①現在の配下メンバー一覧!$A$3:$AD$42,16,FALSE)","v":"00:00:00"}]
{"$rows_left_out":23}
{"sheet":"③提出用","index":2,"n_rows":59,"n_cols":33,"rows_kept":59,"cut":false,"hidden":false,"merged":[[57,20,57,30],[58,19,59,21],[58,22,59,31],[58,32,59,32],[49,29,49,33],[51,2,51,14],[53,2,53,33],[54,22,55,31],[54,32,55,32],[55,4,55,5],[55,6,55,7],[55,9,55,10],[55,12,55,13],[55,19,55,21],[49,2,49,3],[49,4,49,14],[49,15,49,17],[49,18,49,20],[49,21,49,24],[49,25,49,28],[54,19,54,21],[47,29,47,33],[48,2,48,3],[48,4,48,14],[48,15,48,17],[48,18,48,20],[48,21,48,24],[48,25,48,28],[48,29,48,33],[47,2,47,3],[47,4,47,14],[47,15,47,17],[47,18,47,20],[47,21,47,24],[47,25,47,28],[45,29,45,33],[46,2,46,3],[46,4,46,14],[46,15,46,17],[46,18,46,20],[46,21,46,24],[46,25,46,28],[46,29,46,33],[45,2,45,3],[45,4,45,14],[45,15,45,17],[45,18,45,20],[45,21,45,24],[45,25,45,28],[43,29,43,33],[44,2,44,3],[44,4,44,14],[44,15,44,17],[44,18,44,20],[44,21,44,24],[44,25,44,28],[44,29,44,33],[43,2,43,3],[43,4,43,14],[43,15,43,17],[43,18,43,20],[43,21,43,24],[43,25,43,28],[41,29,41,33],[42,2,42,3],[42,4,42,14],[42,15,42,17],[42,18,42,20],[42,21,42,24],[42,25,42,28],[42,29,42,33],[41,2,41,3],[41,4,41,14],[41,15,41,17],[41,18,41,20],[41,21,41,24],[41,25,41,28],[39,29,39,33],[40,2,40,3],[40,4,40,14],[40,15,40,17],[40,18,40,20],[40,21,40,24],[40,25,40,28],[40,29,40,33],[39,2,39,3],[39,4,39,14],[39,15,39,17],[39,18,39,20],[39,21,39,24],[39,25,39,28],[37,29,37,33],[38,2,38,3],[38,4,38,14],[38,15,38,17],[38,18,38,20],[38,21,38,24],[38,25,38,28],[38,29,38,33],[37,2,37,3],[37,4,37,14],[37,15,37,17],[37,18,37,20],[37,21,37,24],[37,25,37,28],[35,29,35,33],[36,2,36,3],[36,4,36,14],[36,15,36,17],[36,18,36,20],[36,21,36,24],[36,25,36,28],[36,29,36,33],[35,2,35,3],[35,4,35,14],[35,15,35,17],[35,18,35,20],[35,21,35,24],[35,25,35,28],[33,29,33,33],[34,2,34,3],[34,4,34,14],[34,15,34,17],[34,18,34,20],[34,21,34,24],[34,25,34,28],[34,29,34,33],[33,2,33,3],[33,4,33,14],[33,15,33,17],[33,18,33,20],[33,21,33,24],[33,25,33,28],[31,29,31,33],[32,2,32,3],[32,4,32,14],[32,15,32,17],[32,18,32,20],[32,21,32,24],[32,25,32,28],[32,29,32,33],[31,2,31,3],[31,4,31,14],[31,15,31,17],[31,18,31,20],[31,21,31,24],[31,25,31,28],[24,2,26,5],[24,6,26,15],[24,16,26,16],[24,18,26,21],[24,22,26,33],[27,2,29,5],[27,6,29,15],[27,18,29,21],[27,22,29,33],[16,25,18,27],[16,28,18,33],[17,12,17,23],[19,12,19,23],[21,2,23,5],[21,6,23,17],[21,18,23,21],[21,22,22,33],[23,25,23,33],[1,2,1,33],[3,4,4,5],[3,6,4,7],[3,8,4,9],[3,25,4,26],[12,31,15,33],[14,2,15,3],[14,4,15,5],[14,6,15,7],[14,23,15,24],[5,11,5,22],[7,1,9,4],[7,11,7,22],[10,1,12,4],[12,25,15,26],[12,27,15,30],[3,10,4,24],[14,8,15,22]]}
[]
[null,null,"※参加申込書に登録用紙の写しを添付のこと。（小・中・高・家婦のみの大会を除く）"]
[]
[null,null,null,null,"平成",null,{"$f":"②入力用!E5","v":0},null,"年度",null,{"$f":"I15","v":{"$error":"#N/A"}},null,null,null,null,null,null,null,null,null,null,null,null,null,null,"大会"]
[]
[null,null,null,null,null,null,null,null,null,null,null,"参　加　申　込　書（控）"]
[]
[null,"県登録番号\n№",null,null,null,null,null,null,null,null,null,"参　加　認　知　書（控）"]
[]
[]
[null,"県登録番号\n№"]
[]
[null,null,null,null,null,null,null,null,null,null,null,null,null,null,null,null,null,null,null,null,null,null,null,null,null,"受付\n№",null,null,null,null,null,{"$f":"②入力用!$F$8","v":{"$error":"#N/A"}}]
[]
[null,null,"平成",null,{"$f":"$G$4","v":0},null,"年度",null,{"$f":"②入力用!$F$6","v":{"$error":"#N/A"}},null,null,null,null,null,null,null,null,null,null,null,null,null,null,"大会"]
[]
[null,null,null,null,null,null,null,null,null,null,null,null,null,null,null,null,null,null,null,null,null,null,null,null,null,"地　区",null,null,{"$f":"②入力用!$E$7","v":0}]
[null,null,null,null,null,null,null,null,null,null,null,null,"参　　加　　申　　込　　書"]
[]
[null,null,null,null,null,null,null,null,null,null,null,null,"参　　加　　認　　知　　書"]
[]
[null,null,"チーム名",null,null,null,{"$f":"②入力用!$E$9","v":0},null,null,null,null,null,null,null,null,null,null,null,"所　在　地",null,null,null,{"$f":"②入力用!$E$10","v":0}]
[]
[null,null,null,null,null,null,null,null,null,null,null,null,null,null,null,null,null,null,null,null,null,null,null,null,"℡",{"$f":"②入力用!$E$11","v":0}]
[null,null,"監　　　督",null,null,null,{"$f":"②入力用!$E$12","v":0},null,null,null,null,null,null,null,null,null,"印",null,"ﾏﾈｰｼﾞｬｰ",null,null,null,{"$f":"②入力用!$E$13","v":0}]
[]
[]
[null,null,"コ ー チ",null,null,null,{"$f":"②入力用!$E$14","v":0},null,null,null,null,null,null,null,null,null,null,null,"主　　　将",null,null,null,{"$f":"②入力用!$E$15","v":0}]
[]
[]
[]
[null,null,"番 号",null,"選　　手　　氏　　名",null,null,null,null,null,null,null,null,null,null,"年　　令",null,null,"学　　年",null,null,"身　　長",null,null,null,"健康状態",null,null,null,"備　　　考"]
[null,null,1,null,{"$f":"②入力用!D23","v":""},null,null,null,null,null,null,null,null,null,null,{"$f":"②入力用!E23","v":""},null,null,{"$f":"②入力用!F23","v":""},null,null,{"$f":"②入力用!G23","v":""},null,null,null,{"$f":"②入力用!$E$16","v":0},null,null,null,{"$f":"VLOOKUP(C33,②入力用!$B$23:$C$40,2,FALSE)","v":0}]
[null,null,2,null,{"$f":"②入力用!D24","v":""},null,null,null,null,null,null,null,null,null,null,{"$f":"②入力用!E24","v":""},null,null,{"$f":"②入力用!F24","v":""},null,null,{"$f":"②入力用!G24","v":""},null,null,null,{"$f":"②入力用!$E$16","v":0},null,null,null,{"$f":"VLOOKUP(C34,②入力用!$B$23:$C$40,2,FALSE)","v":0}]
[null,null,3,null,{"$f":"②入力用!D25","v":""},null,null,null,null,null,null,null,null,null,null,{"$f":"②入力用!E25","v":""},null,null,{"$f":"②入力用!F25","v":""},null,null,{"$f":"②入力用!G25","v":""},null,null,null,{"$f":"②入力用!$E$16","v":0},null,null,null,{"$f":"VLOOKUP(C35,②入力用!$B$23:$C$40,2,FALSE)","v":0}]
[null,null,4,null,{"$f":"②入力用!D26","v":""},null,null,null,null,null,null,null,null,null,null,{"$f":"②入力用!E26","v":""},null,null,{"$f":"②入力用!F26","v":""},null,null,{"$f":"②入力用!G26","v":""},null,null,null,{"$f":"②入力用!$E$16","v":0},null,null,null,{"$f":"VLOOKUP(C36,②入力用!$B$23:$C$40,2,FALSE)","v":0}]
[null,null,5,null,{"$f":"②入力用!D27","v":""},null,null,null,null,null,null,null,null,null,null,{"$f":"②入力用!E27","v":""},null,null,{"$f":"②入力用!F27","v":""},null,null,{"$f":"②入力用!G27","v":""},null,null,null,{"$f":"②入力用!$E$16","v":0},null,null,null,{"$f":"VLOOKUP(C37,②入力用!$B$23:$C$40,2,FALSE)","v":0}]
[null,null,6,null,{"$f":"②入力用!D28","v":""},null,null,null,null,null,null,null,null,null,null,{"$f":"②入力用!E28","v":""},null,null,{"$f":"②入力用!F28","v":""},null,null,{"$f":"②入力用!G28","v":""},null,null,null,{"$f":"②入力用!$E$16","v":0},null,null,null,{"$f":"VLOOKUP(C38,②入力用!$B$23:$C$40,2,FALSE)","v":0}]
[null,null,7,null,{"$f":"②入力用!D29","v":""},null,null,null,null,null,null,null,null,null,null,{"$f":"②入力用!E29","v":""},null,null,{"$f":"②入力用!F29","v":""},null,null,{"$f":"②入力用!G29","v":""},null,null,null,{"$f":"②入力用!$E$16","v":0},null,null,null,{"$f":"VLOOKUP(C39,②入力用!$B$23:$C$40,2,FALSE)","v":0}]
[null,null,8,null,{"$f":"②入力用!D30","v":""},null,null,null,null,null,null,null,null,null,null,{"$f":"②入力用!E30","v":""},null,null,{"$f":"②入力用!F30","v":""},null,null,{"$f":"②入力用!G30","v":""},null,null,null,{"$f":"②入力用!$E$16","v":0},null,null,null,{"$f":"VLOOKUP(C40,②入力用!$B$23:$C$40,2,FALSE)","v":0}]
{"$rows_left_out":20}
{"sheet":"ラインナップシート","index":3,"n_rows":32,"n_cols":19,"rows_kept":32,"cut":false,"hidden":false,"merged":[[2,18,2,19],[3,2,3,3],[3,4,3,5],[3,9,3,10],[3,11,3,12],[3,16,3,17],[3,18,3,19],[2,2,2,3],[2,4,2,5],[2,9,2,10],[2,11,2,12],[2,16,2,17],[4,11,4,12],[4,16,4,17],[9,1,9,5],[9,8,9,12],[9,15,9,19],[5,2,5,3],[5,4,5,5],[5,9,5,10],[5,11,5,12],[5,16,5,17],[5,18,5,19],[4,18,4,19],[4,2,4,3],[4,4,4,5],[4,9,4,10],[14,18,14,19],[13,2,13,3],[13,4,13,5],[13,9,13,10],[13,11,13,12],[13,16,13,17],[13,18,13,19],[14,2,14,3],[14,4,14,5],[14,9,14,10],[14,11,14,12],[14,16,14,17],[16,18,16,19],[15,2,15,3],[15,4,15,5],[15,9,15,10],[15,11,15,12],[15,16,15,17],[15,18,15,19],[16,2,16,3],[16,4,16,5],[16,9,16,10],[16,11,16,12],[16,16,16,17],[24,18,24,19],[20,1,20,5],[20,8,20,12],[20,15,20,19],[22,9,22,12],[22,16,22,19],[24,2,24,3],[24,4,24,5],[24,9,24,10],[24,11,24,12],[24,16,24,17],[26,18,26,19],[25,2,25,3],[25,4,25,5],[25,9,25,10],[25,11,25,12],[25,16,25,17],[25,18,25,19],[26,2,26,3],[26,4,26,5],[26,9,26,10],[26,11,26,12],[26,16,26,17],[31,1,31,5],[31,8,31,12],[31,15,31,19],[0,2,0,5],[0,9,0,12],[0,16,0,19],[11,16,11,19],[11,9,11,12],[11,2,11,5],[22,2,22,5],[27,2,27,3],[27,4,27,5],[27,9,27,10],[27,11,27,12],[27,16,27,17],[27,18,27,19]]}
[null,"チーム名",{"$f":"③提出用!$G$22","v":0},null,null,null,null,null,"チーム名",{"$f":"③提出用!$G$22","v":0},null,null,null,null,null,"チーム名",{"$f":"③提出用!$G$22","v":0}]
[null,null,1,"セット",null,null,null,null,null,2,"セット",null,null,null,null,null,3,"セット"]
[null,"Ⅳ","Ⅲ",null,"Ⅱ",null,null,null,"Ⅳ","Ⅲ",null,"Ⅱ",null,null,null,"Ⅳ","Ⅲ",null,"Ⅱ"]
[]
[null,"Ⅴ","Ⅵ",null,"Ⅰ",null,null,null,"Ⅴ","Ⅵ",null,"Ⅰ",null,null,null,"Ⅴ","Ⅵ",null,"Ⅰ"]
[]
[]
[null,"監督サイン",null,null,null,null,null,null,"監督サイン",null,null,null,null,null,null,"監督サイン"]
[]
[null,"岐阜県高体連バレーボール専門部",null,null,null,null,null,null,"岐阜県高体連バレーボール専門部",null,null,null,null,null,null,"岐阜県高体連バレーボール専門部"]
[]
[null,"チーム名",{"$f":"③提出用!$G$22","v":0},null,null,null,null,null,"チーム名",{"$f":"③提出用!$G$22","v":0},null,null,null,null,null,"チーム名",{"$f":"③提出用!$G$22","v":0}]
[null,null,1,"セット",null,null,null,null,null,2,"セット",null,null,null,null,null,3,"セット"]
[null,"Ⅳ","Ⅲ",null,"Ⅱ",null,null,null,"Ⅳ","Ⅲ",null,"Ⅱ",null,null,null,"Ⅳ","Ⅲ",null,"Ⅱ"]
[]
[null,"Ⅴ","Ⅵ",null,"Ⅰ",null,null,null,"Ⅴ","Ⅵ",null,"Ⅰ",null,null,null,"Ⅴ","Ⅵ",null,"Ⅰ"]
[]
[]
[null,"監督サイン",null,null,null,null,null,null,"監督サイン",null,null,null,null,null,null,"監督サイン"]
[]
[null,"岐阜県高体連バレーボール専門部",null,null,null,null,null,null,"岐阜県高体連バレーボール専門部",null,null,null,null,null,null,"岐阜県高体連バレーボール専門部"]
[]
[null,"チーム名",{"$f":"③提出用!$G$22","v":0},null,null,null,null,null,"チーム名",{"$f":"③提出用!$G$22","v":0},null,null,null,null,null,"チーム名",{"$f":"③提出用!$G$22","v":0}]
[null,null,1,"セット",null,null,null,null,null,2,"セット",null,null,null,null,null,3,"セット"]
[null,"Ⅳ","Ⅲ",null,"Ⅱ",null,null,null,"Ⅳ","Ⅲ",null,"Ⅱ",null,null,null,"Ⅳ","Ⅲ",null,"Ⅱ"]
[]
[null,"Ⅴ","Ⅵ",null,"Ⅰ",null,null,null,"Ⅴ","Ⅵ",null,"Ⅰ",null,null,null,"Ⅴ","Ⅵ",null,"Ⅰ"]
[]
[]
[null,"監督サイン",null,null,null,null,null,null,"監督サイン",null,null,null,null,null,null,"監督サイン"]
[]
[null,"岐阜県高体連バレーボール専門部",null,null,null,null,null,null,"岐阜県高体連バレーボール専門部",null,null,null,null,null,null,"岐阜県高体連バレーボール専門部"]

{"sheet":"構成メンバー","index":4,"n_rows":45,"n_cols":20,"rows_kept":45,"cut":false,"hidden":true,"merged":[[0,0,0,20],[24,0,44,0],[14,2,14,5],[15,2,15,5],[14,9,14,12],[15,9,15,12],[14,16,14,19],[15,16,15,19],[36,2,36,5],[37,2,37,5],[36,9,36,12],[37,9,37,12],[36,16,36,19],[37,16,37,19],[24,2,24,4],[24,9,24,11],[24,16,24,18],[2,2,2,4],[2,9,2,11],[2,16,2,18],[2,0,3,0],[2,7,3,7],[2,14,3,14],[9,16,9,19],[10,16,10,19],[11,16,11,19],[12,16,12,19],[13,16,13,19],[16,16,16,19],[21,9,21,12],[22,9,22,12],[3,2,3,5],[4,2,4,5],[5,2,5,5],[6,2,6,5],[7,2,7,5],[13,9,13,12],[16,9,16,12],[17,9,17,12],[18,8,18,12],[8,2,8,5],[9,2,9,5],[10,2,10,5],[11,2,11,5],[12,9,12,12],[39,16,39,19],[40,15,40,19],[41,16,41,19],[42,16,42,19],[43,16,43,19],[44,16,44,19],[31,16,31,19],[32,16,32,19],[33,16,33,19],[34,16,34,19],[35,16,35,19],[38,16,38,19],[26,16,26,19],[27,16,27,19],[28,16,28,19],[29,16,29,19],[30,16,30,19],[17,16,17,19],[18,15,18,19],[19,16,19,19],[20,16,20,19],[21,16,21,19],[22,16,22,19],[42,9,42,12],[43,9,43,12],[44,9,44,12],[3,16,3,19],[4,16,4,19],[5,16,5,19],[6,16,6,19],[7,16,7,19],[8,16,8,19],[33,9,33,12],[34,9,34,12],[35,9,35,12],[38,9,38,12],[39,9,39,12],[40,8,40,12],[27,9,27,12],[28,9,28,12],[29,9,29,12],[30,9,30,12],[31,9,31,12],[32,9,32,12],[19,9,19,12],[20,9,20,12],[25,16,25,19],[43,2,43,5],[26,2,26,5],[27,2,27,5],[28,2,28,5],[12,2,12,5],[13,2,13,5],[16,2,16,5],[17,2,17,5],[19,2,19,5],[20,2,20,5],[18,1,18,5],[34,2,34,5],[21,2,21,5],[22,2,22,5],[25,2,25,5],[41,9,41,12],[44,2,44,5],[3,9,3,12],[4,9,4,12],[5,9,5,12],[6,9,6,12],[7,9,7,12],[8,9,8,12],[9,9,9,12],[10,9,10,12],[35,2,35,5],[38,2,38,5],[39,2,39,5],[40,1,40,5],[41,2,41,5],[42,2,42,5],[29,2,29,5],[30,2,30,5],[31,2,31,5],[32,2,32,5],[33,2,33,5],[25,9,25,12],[26,9,26,12],[11,9,11,12]]}
["提出用シートの番号を黄色部分に入力・競技者番号は背番号を入力"]
[null,null,null,null,null,"↓",null,null,null,null,"↓",null,null,null,null,"↓"]
["提出用番号\n入力",null,{"$f":"③提出用!$G$22","v":0},null,null,"チーム名",null,"提出用番号\n入力",null,{"$f":"③提出用!$G$22","v":0},null,null,"チーム名",null,"提出用番号\n入力",null,{"$f":"③提出用!$G$22","v":0},null,null,"チーム名"]
[null,"競技者\n番号","氏名",null,null,null,null,null,"競技者\n番号","氏名",null,null,null,null,null,"競技者\n番号","氏名"]
[null,null,{"$f":"IF(A5=\"\",\"\",VLOOKUP(A5,③提出用!$C$33:$O$50,3,FALSE))","v":""},null,null,null,null,null,null,{"$f":"IF(H5=\"\",\"\",VLOOKUP(H5,③提出用!$C$33:$O$50,3,FALSE))","v":""},null,null,null,null,null,null,{"$f":"IF(O5=\"\",\"\",VLOOKUP(O5,③提出用!$C$33:$O$50,3,FALSE))","v":""}]
[null,null,{"$f":"IF(A6=\"\",\"\",VLOOKUP(A6,③提出用!$C$33:$O$50,3,FALSE))","v":""},null,null,null,null,null,null,{"$f":"IF(H6=\"\",\"\",VLOOKUP(H6,③提出用!$C$33:$O$50,3,FALSE))","v":""},null,null,null,null,null,null,{"$f":"IF(O6=\"\",\"\",VLOOKUP(O6,③提出用!$C$33:$O$50,3,FALSE))","v":""}]
[null,null,{"$f":"IF(A7=\"\",\"\",VLOOKUP(A7,③提出用!$C$33:$O$50,3,FALSE))","v":""},null,null,null,null,null,null,{"$f":"IF(H7=\"\",\"\",VLOOKUP(H7,③提出用!$C$33:$O$50,3,FALSE))","v":""},null,null,null,null,null,null,{"$f":"IF(O7=\"\",\"\",VLOOKUP(O7,③提出用!$C$33:$O$50,3,FALSE))","v":""}]
[null,null,{"$f":"IF(A8=\"\",\"\",VLOOKUP(A8,③提出用!$C$33:$O$50,3,FALSE))","v":""},null,null,null,null,null,null,{"$f":"IF(H8=\"\",\"\",VLOOKUP(H8,③提出用!$C$33:$O$50,3,FALSE))","v":""},null,null,null,null,null,null,{"$f":"IF(O8=\"\",\"\",VLOOKUP(O8,③提出用!$C$33:$O$50,3,FALSE))","v":""}]
[null,null,{"$f":"IF(A9=\"\",\"\",VLOOKUP(A9,③提出用!$C$33:$O$50,3,FALSE))","v":""},null,null,null,null,null,null,{"$f":"IF(H9=\"\",\"\",VLOOKUP(H9,③提出用!$C$33:$O$50,3,FALSE))","v":""},null,null,null,null,null,null,{"$f":"IF(O9=\"\",\"\",VLOOKUP(O9,③提出用!$C$33:$O$50,3,FALSE))","v":""}]
[null,null,{"$f":"IF(A10=\"\",\"\",VLOOKUP(A10,③提出用!$C$33:$O$50,3,FALSE))","v":""},null,null,null,null,null,null,{"$f":"IF(H10=\"\",\"\",VLOOKUP(H10,③提出用!$C$33:$O$50,3,FALSE))","v":""},null,null,null,null,null,null,{"$f":"IF(O10=\"\",\"\",VLOOKUP(O10,③提出用!$C$33:$O$50,3,FALSE))","v":""}]
[null,null,{"$f":"IF(A11=\"\",\"\",VLOOKUP(A11,③提出用!$C$33:$O$50,3,FALSE))","v":""},null,null,null,null,null,null,{"$f":"IF(H11=\"\",\"\",VLOOKUP(H11,③提出用!$C$33:$O$50,3,FALSE))","v":""},null,null,null,null,null,null,{"$f":"IF(O11=\"\",\"\",VLOOKUP(O11,③提出用!$C$33:$O$50,3,FALSE))","v":""}]
[null,null,{"$f":"IF(A12=\"\",\"\",VLOOKUP(A12,③提出用!$C$33:$O$50,3,FALSE))","v":""},null,null,null,null,null,null,{"$f":"IF(H12=\"\",\"\",VLOOKUP(H12,③提出用!$C$33:$O$50,3,FALSE))","v":""},null,null,null,null,null,null,{"$f":"IF(O12=\"\",\"\",VLOOKUP(O12,③提出用!$C$33:$O$50,3,FALSE))","v":""}]
[null,null,{"$f":"IF(A13=\"\",\"\",VLOOKUP(A13,③提出用!$C$33:$O$50,3,FALSE))","v":""},null,null,null,null,null,null,{"$f":"IF(H13=\"\",\"\",VLOOKUP(H13,③提出用!$C$33:$O$50,3,FALSE))","v":""},null,null,null,null,null,null,{"$f":"IF(O13=\"\",\"\",VLOOKUP(O13,③提出用!$C$33:$O$50,3,FALSE))","v":""}]
[null,null,{"$f":"IF(A14=\"\",\"\",VLOOKUP(A14,③提出用!$C$33:$O$50,3,FALSE))","v":""},null,null,null,null,null,null,{"$f":"IF(H14=\"\",\"\",VLOOKUP(H14,③提出用!$C$33:$O$50,3,FALSE))","v":""},null,null,null,null,null,null,{"$f":"IF(O14=\"\",\"\",VLOOKUP(O14,③提出用!$C$33:$O$50,3,FALSE))","v":""}]
[null,null,{"$f":"IF(A15=\"\",\"\",VLOOKUP(A15,③提出用!$C$33:$O$50,3,FALSE))","v":""},null,null,null,null,null,null,{"$f":"IF(H15=\"\",\"\",VLOOKUP(H15,③提出用!$C$33:$O$50,3,FALSE))","v":""},null,null,null,null,null,null,{"$f":"IF(O15=\"\",\"\",VLOOKUP(O15,③提出用!$C$33:$O$50,3,FALSE))","v":""}]
[null,null,{"$f":"IF(A16=\"\",\"\",VLOOKUP(A16,③提出用!$C$33:$O$50,3,FALSE))","v":""},null,null,null,null,null,null,{"$f":"IF(H16=\"\",\"\",VLOOKUP(H16,③提出用!$C$33:$O$50,3,FALSE))","v":""},null,null,null,null,null,null,{"$f":"IF(O16=\"\",\"\",VLOOKUP(O16,③提出用!$C$33:$O$50,3,FALSE))","v":""}]
[null,null,{"$f":"IF(A17=\"\",\"\",VLOOKUP(A17,③提出用!$C$33:$O$50,3,FALSE))","v":""},null,null,null,null,null,null,{"$f":"IF(H17=\"\",\"\",VLOOKUP(H17,③提出用!$C$33:$O$50,3,FALSE))","v":""},null,null,null,null,null,null,{"$f":"IF(O17=\"\",\"\",VLOOKUP(O17,③提出用!$C$33:$O$50,3,FALSE))","v":""}]
[null,null,{"$f":"IF(A18=\"\",\"\",VLOOKUP(A18,③提出用!$C$33:$O$50,3,FALSE))","v":""},null,null,null,null,null,null,{"$f":"IF(H18=\"\",\"\",VLOOKUP(H18,③提出用!$C$33:$O$50,3,FALSE))","v":""},null,null,null,null,null,null,{"$f":"IF(O18=\"\",\"\",VLOOKUP(O18,③提出用!$C$33:$O$50,3,FALSE))","v":""}]
[null,"リベロ選手",null,null,null,null,null,null,"リベロ選手",null,null,null,null,null,null,"リベロ選手"]
[null,null,{"$f":"IF(A20=\"\",\"\",VLOOKUP(A20,③提出用!$C$33:$O$50,3,FALSE))","v":""},null,null,null,null,null,null,{"$f":"IF(H20=\"\",\"\",VLOOKUP(H20,③提出用!$C$33:$O$50,3,FALSE))","v":""},null,null,null,null,null,null,{"$f":"IF(O20=\"\",\"\",VLOOKUP(O20,③提出用!$C$33:$O$50,3,FALSE))","v":""}]
[null,null,{"$f":"IF(A21=\"\",\"\",VLOOKUP(A21,③提出用!$C$33:$O$50,3,FALSE))","v":""},null,null,null,null,null,null,{"$f":"IF(H21=\"\",\"\",VLOOKUP(H21,③提出用!$C$33:$O$50,3,FALSE))","v":""},null,null,null,null,null,null,{"$f":"IF(O21=\"\",\"\",VLOOKUP(O21,③提出用!$C$33:$O$50,3,FALSE))","v":""}]
[null,"主将\nサイン",null,null,null,null,null,null,"主将\nサイン",null,null,null,null,null,null,"主将\nサイン"]
[null,"監督\nサイン",null,null,null,null,null,null,"監督\nサイン",null,null,null,null,null,null,"監督\nサイン"]
[]
["↑　直接入力、手書き用　↑",null,null,null,null,"チーム名",null,null,null,null,null,null,"チーム名",null,null,null,null,null,null,"チーム名"]
[null,"競技者\n番号","氏名",null,null,null,null,null,"競技者\n番号","氏名",null,null,null,null,null,"競技者\n番号","氏名"]
[]
[]
[]
[]
[]
[]
[]
[]
[]
[]
[]
[]
[]
[]
{"$rows_left_out":6}
{"sheet":"方法","index":5,"n_rows":6,"n_cols":2,"rows_kept":6,"cut":false,"hidden":true,"merged":[]}
[1,"「JVA-MRS」の「メンバー一括設定メンバー」→「一括所属変更（新規登録、継続）」から「現在の配下メンバー一覧」シートへコピー、貼り付けをする。"]
[2,"「入力用」シートの黄色部分を入力"]
[3,"「提出用」シートを確認し申込時にＭＲＳと一緒に提出"]
[4,"「構成メンバー」シートの黄色部分を入力または直接入力し、\n切り取ってから試合当日に受付へ提出"]
[5,"「ラインナップシート」シートを試合前に提出できるよう準備"]
["注意","「構成メンバー」と「ラインナップシート」は試合当日の受付で配布するので\n試合当日に書き込んで提出をしてもよい"]